lkml.org 
[lkml]   [2003]   [Sep]   [28]   [last100]   RSS Feed
Views: [wrap][no wrap]   [headers]  [forward] 
 
Messages in this thread
/
SubjectRe: Linux 2.6.0-test6
From
Date
CC [M]  drivers/net/wireless/arlan-main.o
drivers/net/wireless/arlan-main.c: In function `init_module':
drivers/net/wireless/arlan-main.c:1923: error: `probe' undeclared (first
use in this function)
drivers/net/wireless/arlan-main.c:1923: error: (Each undeclared
identifier is reported only once
drivers/net/wireless/arlan-main.c:1923: error: for each function it
appears in.)
make[3]: *** [drivers/net/wireless/arlan-main.o] Error 1
make[2]: *** [drivers/net/wireless] Error 2
make[1]: *** [drivers/net] Error 2
make: *** [drivers] Error 2

Regards,
----
Markus Hästbacka <midian@ihme.org>
[unhandled content-type:application/pgp-signature]
\
 
 \ /
  Last update: 2005-03-22 13:48    [W:0.232 / U:34.632 seconds]
©2003-2017 Jasper Spaans. hosted at Digital OceanAdvertise on this site