[lkml]   [2001]   [Nov]   [28]   [last100]   RSS Feed
Views: [wrap][no wrap]   [headers]  [forward] 
Messages in this thread
Subject2.5.1-pre3 Build Failure
Seems I'm not the only one with this problem either.

gcc -D__KERNEL__ -I/root/linux/linux-2.5/include -Wall -Wstrict-prototypes -
Wno-trigraphs -O2 -fomit-frame-pointer -fno-strict-aliasing -fno-common -pip
e -mpreferred-stack-boundary=2 -march=i686 -c -o pc_keyb.o pc_keyb.c
pc_keyb.c:423: macro `spin_unlock' used with too many (2) args
pc_keyb.c:1059: macro `spin_unlock_irqrestore' used with just one arg
pc_keyb.c:1079: macro `spin_unlock_irqrestore' used with just one arg
pc_keyb.c: In function `release_aux':
pc_keyb.c:1059: parse error before `)'
pc_keyb.c: In function `open_aux':
pc_keyb.c:1079: parse error before `)'
make[3]: *** [pc_keyb.o] Error 1
make[3]: Leaving directory `/root/linux/linux-2.5/drivers/char'
make[2]: *** [first_rule] Error 2
make[2]: Leaving directory `/root/linux/linux-2.5/drivers/char'
make[1]: *** [_subdir_char] Error 2
make[1]: Leaving directory `/root/linux/linux-2.5/drivers'
make: *** [_dir_drivers] Error 2

To unsubscribe from this list: send the line "unsubscribe linux-kernel" in
the body of a message to
More majordomo info at
Please read the FAQ at

 \ /
  Last update: 2005-03-22 13:13    [W:0.037 / U:0.800 seconds]
©2003-2020 Jasper Spaans|hosted at Digital Ocean and TransIP|Read the blog|Advertise on this site