lkml.org 
[lkml]   [2020]   [Mar]   [25]   [last100]   RSS Feed
Views: [wrap][no wrap]   [headers]  [forward] 
 
Messages in this thread
/
From
Date
Subjectperf failure list
We have been noticing multiple perf test failures on LKFT test plan.
I request you to investigate these problems.
Please guide us to enable missing Kconfigs and userspace tools.

The listed failures are from stable rc 5.5 branch.

arm beagleboard x15 device [1] & [2]
----------------------------
PERF_RECORD_* events & perf_sample fields: FAILED!
'import perf' in python: FAILED!
Watchpoint subtest 1: FAILED!
Watchpoint subtest 2: FAILED!
Watchpoint subtest 4: FAILED!
Object code reading: FAILED!
LLVM search and compile subtest 1: FAILED!
Session topology: FAILED!
Merge cpu map: FAILED!
time utils: FAILED!
DWARF unwind: FAILED!
PERF_RECORD_*-events-&-perf_sample-fields FAILED!
'import-perf'-in-python FAILED!
Watchpoint-subtest-1 FAILED!
Watchpoint-subtest-2 FAILED!
Watchpoint-subtest-4 FAILED!
Object-code-reading FAILED!
LLVM-search-and-compile-subtest-1 FAILED!
Session-topology FAILED!
Merge-cpu-map FAILED!
time-utils FAILED!
DWARF-unwind FAILED!

arm64 Juno [3] & [4]
-----------------
PERF_RECORD_* events & perf_sample fields: FAILED!
'import perf' in python: FAILED!
Number of exit events of a simple workload: FAILED!
Object code reading: FAILED!
LLVM search and compile subtest 1: FAILED!
Session topology: FAILED!
PERF_RECORD_*-events-&-perf_sample-fields FAILED!
'import-perf'-in-python FAILED!
Number-of-exit-events-of-a-simple-workload FAILED!
Object-code-reading FAILED!
LLVM-search-and-compile-subtest-1 FAILED!
Session-topology FAILED!

x86_64 [5] & [6]
-----------
PERF_RECORD_* events & perf_sample fields: FAILED!
'import perf' in python: FAILED!
LLVM search and compile subtest 1: FAILED!
Session topology: FAILED!
PERF_RECORD_*-events-&-perf_sample-fields FAILED!
'import-perf'-in-python FAILED!
LLVM-search-and-compile-subtest-1 FAILED!
Session-topology FAILED!



[1]
https://qa-reports.linaro.org/lkft/linux-stable-rc-5.5-oe/build/v5.5.11-120-g738ff80e1bc6/testrun/1311723/suite/perf/tests/
[2]
https://qa-reports.linaro.org/lkft/linux-stable-rc-5.5-oe/build/v5.5.11-120-g738ff80e1bc6/testrun/1311723/log

[3]
https://qa-reports.linaro.org/lkft/linux-stable-rc-5.5-oe/build/v5.5.11-120-g738ff80e1bc6/testrun/1311746/suite/perf/tests/

[4]
https://qa-reports.linaro.org/lkft/linux-stable-rc-5.5-oe/build/v5.5.11-120-g738ff80e1bc6/testrun/1311746/log

[5]
https://qa-reports.linaro.org/lkft/linux-stable-rc-5.5-oe/build/v5.5.11-120-g738ff80e1bc6/testrun/1311665/suite/perf/tests/

[6]
https://qa-reports.linaro.org/lkft/linux-stable-rc-5.5-oe/build/v5.5.11-120-g738ff80e1bc6/testrun/1311665/log
--
Linaro LKFT
https://lkft.linaro.org

\
 
 \ /
  Last update: 2020-03-25 06:47    [W:0.020 / U:26.284 seconds]
©2003-2020 Jasper Spaans|hosted at Digital Ocean and TransIP|Read the blog|Advertise on this site