[lkml]   [2012]   [Feb]   [9]   [last100]   RSS Feed
Views: [wrap][no wrap]   [headers]  [forward] 
Messages in this thread
Subjectlinux-next: build failure after merge of the staging tree
Hi Greg,

After merging the staging tree, today's linux-next build (x86_64
allmodconfig) failed like this:

drivers/staging/ramster/ramster_o2net.c: In function 'ramster_remote_async_get_request_handler':
drivers/staging/ramster/ramster_o2net.c:91:2: error: implicit declaration of function 'o2net_force_data_magic' [-Werror=implicit-function-declaration]
drivers/staging/ramster/ramster_o2net.c: In function 'ramster_remote_put':
drivers/staging/ramster/ramster_o2net.c:250:2: error: implicit declaration of function 'o2net_nn_from_num' [-Werror=implicit-function-declaration]
drivers/staging/ramster/zcache-main.c:40:64: fatal error: ../zram/xvmalloc.h: No such file or directory

Caused by commits ba351b02ab11 ("staging: ramster: local compression +
tmem") and 14a3cd58dd4f ("staging: ramster: ramster-specific new files").

I have used the version of the staging tree from next-20120209 for today.

Stephen Rothwell
[unhandled content-type:application/pgp-signature]
 \ /
  Last update: 2012-02-10 06:01    [W:0.074 / U:5.380 seconds]
©2003-2020 Jasper Spaans|hosted at Digital Ocean and TransIP|Read the blog|Advertise on this site