[lkml]   [2012]   [Feb]   [10]   [last100]   RSS Feed
Views: [wrap][no wrap]   [headers]  [forward] 
Messages in this thread
SubjectRe: linux-next: build failure after merge of the staging tree
On Fri, Feb 10, 2012 at 03:58:00PM +1100, Stephen Rothwell wrote:
> Hi Greg,
> After merging the staging tree, today's linux-next build (x86_64
> allmodconfig) failed like this:
> drivers/staging/ramster/ramster_o2net.c: In function 'ramster_remote_async_get_request_handler':
> drivers/staging/ramster/ramster_o2net.c:91:2: error: implicit declaration of function 'o2net_force_data_magic' [-Werror=implicit-function-declaration]
> drivers/staging/ramster/ramster_o2net.c: In function 'ramster_remote_put':
> drivers/staging/ramster/ramster_o2net.c:250:2: error: implicit declaration of function 'o2net_nn_from_num' [-Werror=implicit-function-declaration]
> drivers/staging/ramster/zcache-main.c:40:64: fatal error: ../zram/xvmalloc.h: No such file or directory
> Caused by commits ba351b02ab11 ("staging: ramster: local compression +
> tmem") and 14a3cd58dd4f ("staging: ramster: ramster-specific new files").
> I have used the version of the staging tree from next-20120209 for today.

Ugh, I wonder why it builds here, very odd.

Dan, care to send me a patch to fix this?

greg k-h

 \ /
  Last update: 2012-02-10 06:37    [W:0.064 / U:0.768 seconds]
©2003-2020 Jasper Spaans|hosted at Digital Ocean and TransIP|Read the blog|Advertise on this site