lkml.org 
[lkml]   [2010]   [Feb]   [17]   [last100]   RSS Feed
Views: [wrap][no wrap]   [headers]  [forward] 
 
Messages in this thread
/
Date
SubjectRe: [PATCH V2 net-next 1/2] usbnet: Convert dev(dbg|err|warn|info) macros to netdev_<level>
From

I had to revert this series, the build fails:

drivers/net/wireless/rndis_wlan.c: In function 'rndis_query_oid':
drivers/net/wireless/rndis_wlan.c:731: error: implicit declaration of function 'devdbg'
drivers/net/wireless/rndis_wlan.c: In function 'set_essid':
drivers/net/wireless/rndis_wlan.c:948: error: implicit declaration of function 'devwarn'
drivers/net/wireless/rndis_wlan.c: In function 'rndis_connect':
drivers/net/wireless/rndis_wlan.c:1796: error: implicit declaration of function 'deverr'
drivers/net/wireless/rndis_wlan.c: In function 'rndis_wlan_auth_indication':
drivers/net/wireless/rndis_wlan.c:2273: error: implicit declaration of function 'devinfo'
make[3]: *** [drivers/net/wireless/rndis_wlan.o] Error 1
make[3]: *** Waiting for unfinished jobs....

\
 
 \ /
  Last update: 2010-02-17 09:07    [from the cache]
©2003-2011 Jasper Spaans