lkml.org 
[lkml]   [2008]   [Jul]   [1]   [last100]   RSS Feed
Views: [wrap][no wrap]   [headers]  [forward] 
 
Messages in this thread
/
Date
From
SubjectRe: inux-next 0701 mv643xx_eth powerpc build failure
On Wed, Jul 02, 2008 at 01:14:34AM +1000, Stephen Rothwell wrote:

[next-20080701]

I'm getting a build failure on 32bit powerpc in -next, but not in mainline:

drivers/net/mv643xx_eth.c: In function 'mv643xx_eth_netpoll':
drivers/net/mv643xx_eth.c:2115: error: 'INT_CAUSE_EXT' undeclared
(first use in this function)
drivers/net/mv643xx_eth.c:2115: error: (Each undeclared identifier is
reported only once
drivers/net/mv643xx_eth.c:2115: error: for each function it appears in.)

I haven't investigated any further than a quick check if this hardware
even makes sense on 32bit powerpc -- it seems it does. For now, I'm
just going to punt this and go to bed. :-)

--
Joseph Fannin
jfannin@gmail.com


\
 
 \ /
  Last update: 2008-07-02 05:13    [W:0.189 / U:0.964 seconds]
©2003-2020 Jasper Spaans|hosted at Digital Ocean and TransIP|Read the blog|Advertise on this site