lkml.org 
[lkml]   [2007]   [Dec]   [11]   [last100]   RSS Feed
Views: [wrap][no wrap]   [headers]  [forward] 
 
Messages in this thread
/
Date
From
SubjectRe: 2.6.24-rc4-mm1
>> I can't see this compile failure posted anywhere:
>> http://test.kernel.org/results/IBM/126049/build/debug/stderr
>>
>> arch/x86/vdso/vdso32/sigreturn.S: Assembler messages:
>> arch/x86/vdso/vdso32/sigreturn.S:23: Error: suffix or operands invalid
>> for `pop'
>>
>> arch/x86/vdso/vdso32/syscall.S:25: Error: suffix or operands invalid for
>> `pop'
>> make[1]: *** [arch/x86/vdso/vdso32/syscall.o] Error 1
>> make: *** [arch/x86/vdso] Error 2
>
> I see those on one build machine but not on another, so I thought
> that it was a tools issue...

If so, it's a tools issue that worked fine until -mm1, which makes
it a kernel problem in my mind ;-)

>> Nor this one:
>> http://test.kernel.org/results/IBM/126096/build/debug/stderr
>>
>> drivers/char/hvcs.c: In function ‘hvcs_open’:
>> drivers/char/hvcs.c:1180: error: wrong type argument to unary
>> exclamation mark
>
> See http://marc.info/?l=linux-kernel&m=119700448119646
> for patches.


Thanks,

M.
--
To unsubscribe from this list: send the line "unsubscribe linux-kernel" in
the body of a message to majordomo@vger.kernel.org
More majordomo info at http://vger.kernel.org/majordomo-info.html
Please read the FAQ at http://www.tux.org/lkml/

\
 
 \ /
  Last update: 2007-12-11 18:53    [W:0.115 / U:0.452 seconds]
©2003-2018 Jasper Spaans|hosted at Digital Ocean and TransIP|Read the blog|Advertise on this site