[lkml]   [2006]   [Aug]   [22]   [last100]   RSS Feed
Views: [wrap][no wrap]   [headers]  [forward] 
Messages in this thread
    Subject[2.6.18-rc4-mm2] Compile error in afs
    With CONFIG_AFS_FSCACHE=n, I get this compile error:

    fs/afs/file.c: In function ‘afs_file_releasepage’:
    fs/afs/file.c:332: error: ‘struct afs_vnode’ has no member named ‘cache’
    make[2]: *** [fs/afs/file.o] Error 1
    make[1]: *** [fs/afs] Error 2
    make: *** [fs] Error 2


    To unsubscribe from this list: send the line "unsubscribe linux-kernel" in
    the body of a message to
    More majordomo info at
    Please read the FAQ at

     \ /
      Last update: 2006-08-22 11:27    [W:0.042 / U:0.032 seconds]
    ©2003-2016 Jasper Spaans. hosted at Digital OceanAdvertise on this site