lkml.org 
[lkml]   [2006]   [Nov]   [29]   [last100]   RSS Feed
Views: [wrap][no wrap]   [headers]  [forward] 
 
Messages in this thread
/
Date
From
Subject2.6.19-rc6-rt9 - fails to compile
Hi!

2.6.19-rc6-rt9 fails to compile on my Dual Core Notebook with FC6.

CHK include/linux/version.h
CHK include/linux/utsrelease.h
CC arch/i386/kernel/asm-offsets.s
In file included from include/linux/time.h:7,
from include/linux/timex.h:57,
from include/linux/sched.h:50,
from include/linux/module.h:9,
from include/linux/crypto.h:21,
from arch/i386/kernel/asm-offsets.c:7:
include/linux/seqlock.h: In function '__read_seqretry':
include/linux/seqlock.h:139: error: expected expression before 'do'
In file included from include/linux/module.h:9,
from include/linux/crypto.h:21,
from arch/i386/kernel/asm-offsets.c:7:
include/linux/sched.h: In function 'dequeue_signal_lock':
include/linux/sched.h:1478: error: expected expression before 'do'
make[1]: *** [arch/i386/kernel/asm-offsets.s] Error 1
make: *** [prepare0] Error 2

www.marcush.de/kernel/.config

Regards,
Marcus
-
To unsubscribe from this list: send the line "unsubscribe linux-kernel" in
the body of a message to majordomo@vger.kernel.org
More majordomo info at http://vger.kernel.org/majordomo-info.html
Please read the FAQ at http://www.tux.org/lkml/

\
 
 \ /
  Last update: 2006-11-29 08:31    [W:0.021 / U:0.508 seconds]
©2003-2020 Jasper Spaans|hosted at Digital Ocean and TransIP|Read the blog|Advertise on this site