[lkml]   [2005]   [Sep]   [12]   [last100]   RSS Feed
Views: [wrap][no wrap]   [headers]  [forward] 
Messages in this thread
SubjectRe: 2.6.13-mm3
I'm getting some build errors on ppc64 in drivers/char/hvc_console.c

CC drivers/char/hvc_console.o
drivers/char/hvc_console.c: In function `hvc_poll':
drivers/char/hvc_console.c:600: error: `count' undeclared (first use in this function)
drivers/char/hvc_console.c:600: error: (Each undeclared identifier is reported only once
drivers/char/hvc_console.c:600: error: for each function it appears in.)
drivers/char/hvc_console.c:636: error: structure has no member named `flip'
make[1]: *** [drivers/char/hvc_console.o] Error 1
make: *** [_module_drivers/char] Error 2

The count undeclared one was easy to fix but I coldn't fix the filp
structure element in 2-3 minutes so I'm punting.

Anyone have a patch to fix this driver?

To unsubscribe from this list: send the line "unsubscribe linux-kernel" in
the body of a message to
More majordomo info at
Please read the FAQ at

 \ /
  Last update: 2005-09-12 21:47    [W:0.123 / U:0.448 seconds]
©2003-2020 Jasper Spaans|hosted at Digital Ocean and TransIP|Read the blog|Advertise on this site