lkml.org 
[lkml]   [2003]   [Aug]   [17]   [last100]   RSS Feed
Views: [wrap][no wrap]   [headers]  [forward] 
 
Messages in this thread
/
Date
From
Subject2.6.0-test3-bk4 bug

The following is in -bk4 but not -bk3:

drivers/ide/pci/amd74xx.c: In function `amd74xx_get_info':
drivers/ide/pci/amd74xx.c:107: structure has no member named `name'
drivers/ide/pci/amd74xx.c: In function `init_chipset_amd74xx':
drivers/ide/pci/amd74xx.c:368: structure has no member named `name'
make[3]: *** [drivers/ide/pci/amd74xx.o] Error 1
make[2]: *** [drivers/ide/pci] Error 2
make[1]: *** [drivers/ide] Error 2
make: *** [drivers] Error 2

Thanks,
Russ
-
To unsubscribe from this list: send the line "unsubscribe linux-kernel" in
the body of a message to majordomo@vger.kernel.org
More majordomo info at http://vger.kernel.org/majordomo-info.html
Please read the FAQ at http://www.tux.org/lkml/

\
 
 \ /
  Last update: 2005-03-22 13:47    [W:0.029 / U:0.436 seconds]
©2003-2020 Jasper Spaans|hosted at Digital Ocean and TransIP|Read the blog|Advertise on this site