lkml.org 
[lkml]   [2002]   [Aug]   [20]   [last100]   RSS Feed
Views: [wrap][no wrap]   [headers]  [forward] 
 
Messages in this thread
/
Date
From
SubjectRe: compil error with a LC_ALL="" !!! why ?
the compiler is gcc-3.2, don't forget this information.

here my error, see my attachment

On Tue, Aug 20, 2002 at 11:05:21AM +0200, Jan Hudec wrote:
> On Tue, Aug 20, 2002 at 10:13:43AM +0200, Stephane Wirtel wrote:
> > when i compile the kernel with a LC_ALL="fr_BE@euro", i have many errors.
> >
> > and when i use a LC_ALL="en_US", i don't have any problem.
>
> Please include the error messages you get.
>
> -------------------------------------------------------------------------------
> Jan 'Bulb' Hudec <bulb@ucw.cz>
> -
> To unsubscribe from this list: send the line "unsubscribe linux-kernel" in
> the body of a message to majordomo@vger.kernel.org
> More majordomo info at http://vger.kernel.org/majordomo-info.html
> Please read the FAQ at http://www.tux.org/lkml/

--
Stephane Wirtel <stephane.wirtel@belgacom.net>
Web : www.linux-mons.be "Linux Is Not UniX !!!"
make[1]: Entre dans le répertoire `/root/linux-2.4.20-pre4/kernel'
make all_targets
make[2]: Entre dans le répertoire `/root/linux-2.4.20-pre4/kernel'
gcc-3.2 -D__KERNEL__ -I/root/linux-2.4.20-pre4/include -Wall -Wstrict-prototypes -Wno-trigraphs -O2 -fno-strict-aliasing -fno-common -pipe -mpreferred-stack-boundary=2 -march=athlon -nostdinc -DKBUILD_BASENAME=sched -fno-omit-frame-pointer -c -o sched.o sched.c
Dans le fichier inclus à partir de /root/linux-2.4.20-pre4/include/linux/wait.h:13,
à partir de /root/linux-2.4.20-pre4/include/linux/fs.h:12,
à partir de /root/linux-2.4.20-pre4/include/linux/capability.h:17,
à partir de /root/linux-2.4.20-pre4/include/linux/binfmts.h:5,
à partir de /root/linux-2.4.20-pre4/include/linux/sched.h:9,
à partir de /root/linux-2.4.20-pre4/include/linux/mm.h:4,
à partir de sched.c:23:
/root/linux-2.4.20-pre4/include/linux/kernel.h:10:20: stdarg.h: Aucun fichier ou répertoire de ce type
Dans le fichier inclus à partir de /root/linux-2.4.20-pre4/include/linux/wait.h:13,
à partir de /root/linux-2.4.20-pre4/include/linux/fs.h:12,
à partir de /root/linux-2.4.20-pre4/include/linux/capability.h:17,
à partir de /root/linux-2.4.20-pre4/include/linux/binfmts.h:5,
à partir de /root/linux-2.4.20-pre4/include/linux/sched.h:9,
à partir de /root/linux-2.4.20-pre4/include/linux/mm.h:4,
à partir de sched.c:23:
/root/linux-2.4.20-pre4/include/linux/kernel.h:74: erreur d'analyse syntaxique avant « va_list »
/root/linux-2.4.20-pre4/include/linux/kernel.h:74: AVERTISSEMENT: déclaration de fonction n'est pas un prototype
/root/linux-2.4.20-pre4/include/linux/kernel.h:77: erreur d'analyse syntaxique avant « va_list »
/root/linux-2.4.20-pre4/include/linux/kernel.h:77: AVERTISSEMENT: déclaration de fonction n'est pas un prototype
/root/linux-2.4.20-pre4/include/linux/kernel.h:81: erreur d'analyse syntaxique avant « va_list »
/root/linux-2.4.20-pre4/include/linux/kernel.h:81: AVERTISSEMENT: déclaration de fonction n'est pas un prototype
make[2]: *** [sched.o] Erreur 1
make[2]: Quitte le répertoire `/root/linux-2.4.20-pre4/kernel'
make[1]: *** [first_rule] Erreur 2
make[1]: Quitte le répertoire `/root/linux-2.4.20-pre4/kernel'
make: *** [_dir_kernel] Erreur 2
bash-2.05a#
\
 
 \ /
  Last update: 2005-03-22 13:28    [W:0.078 / U:1.176 seconds]
©2003-2020 Jasper Spaans|hosted at Digital Ocean and TransIP|Read the blog|Advertise on this site