[lkml]   [2002]   [Jun]   [3]   [last100]   RSS Feed
Views: [wrap][no wrap]   [headers]  [forward] 
Messages in this thread
Subject2.5.20 RAID5 compile error
RAID5 still doesn't compile....sigh....

gcc -D__KERNEL__ -I/usr/src/linux-2.5.14/include -Wall -Wstrict-prototypes -Wno-trigraphs -O2 -fomit-frame-pointer -fno-strict-alias
ing -fno-common -pipe -mpreferred-stack-boundary=2 -march=i686 -DMODULE -DKBUILD_BASENAME=raid5 -c -o raid5.o raid5.c
raid5.c: In function `raid5_plug_device':
raid5.c:1247: `tq_disk' undeclared (first use in this function)
raid5.c:1247: (Each undeclared identifier is reported only once
raid5.c:1247: for each function it appears in.)
raid5.c: In function `run':
raid5.c:1589: sizeof applied to an incomplete type
make[2]: *** [raid5.o] Error 1
make[2]: Leaving directory `/usr/src/linux-2.5.14/drivers/md'
make[1]: *** [_modsubdir_md] Error 2
make[1]: Leaving directory `/usr/src/linux-2.5.14/drivers'
make: *** [_mod_drivers] Error 2

Michael D. Black
321-676-2923, x203
Melbourne FL

To unsubscribe from this list: send the line "unsubscribe linux-kernel" in
the body of a message to
More majordomo info at
Please read the FAQ at

 \ /
  Last update: 2005-03-22 13:22    [W:0.179 / U:0.164 seconds]
©2003-2020 Jasper Spaans|hosted at Digital Ocean and TransIP|Read the blog|Advertise on this site