lkml.org 
[lkml]   [2002]   [Mar]   [23]   [last100]   RSS Feed
Views: [wrap][no wrap]   [headers]  [forward] 
 
Messages in this thread
/
From
SubjectCompile Error with Compaq CCISS
Date
Anyone else seen this? I am using 2.5.7 no prepatch

.c
cciss.c: In function `cciss_ioctl':
cciss.c:645: warning: implicit declaration of function `DECLARE_COMPLETION'
cciss.c:645: `wait' undeclared (first use in this function)
cciss.c:645: (Each undeclared identifier is reported only once
cciss.c:645: for each function it appears in.)
cciss.c:720: warning: implicit declaration of function `wait_for_completion'
cciss.c: In function `sendcmd_withirq':
cciss.c:932: `wait' undeclared (first use in this function)
cciss.c: In function `do_cciss_intr':
cciss.c:1958: warning: implicit declaration of function `complete'
make[3]: *** [cciss.o] Error 1
make[3]: Leaving directory `/usr/src/linux-2.5.7/drivers/block'
make[2]: *** [first_rule] Error 2
make[2]: Leaving directory `/usr/src/linux-2.5.7/drivers/block'
make[1]: *** [_subdir_block] Error 2
make[1]: Leaving directory `/usr/src/linux-2.5.7/drivers'
make: *** [_dir_drivers] Error 2
cumin:/usr/src/linux-2.5.7 #


Regards,

Jon

-
To unsubscribe from this list: send the line "unsubscribe linux-kernel" in
the body of a message to majordomo@vger.kernel.org
More majordomo info at http://vger.kernel.org/majordomo-info.html
Please read the FAQ at http://www.tux.org/lkml/

\
 
 \ /
  Last update: 2005-03-22 13:25    [W:0.038 / U:4.876 seconds]
©2003-2018 Jasper Spaans|hosted at Digital Ocean and TransIP|Read the blog|Advertise on this site