[lkml]   [2001]   [Aug]   [23]   [last100]   RSS Feed
Views: [wrap][no wrap]   [headers]  [forward] 
Messages in this thread
Subject(was posted)2.4.9-compilation error, pls help
sorry but I lost the email and can not compile it. I
still remember that someone made a patch available to
fix it. pls show me :-))

ux/modversions.h -DNTFS_VERSION=\"1.1.16\" -c -o
unistr.o unistr.c
unistr.c: In function `ntfs_collate_names':
unistr.c:99: warning: implicit declaration of function
unistr.c:99: parse error before `unsigned'
unistr.c:99: parse error before `)'
unistr.c:97: warning: `c1' might be used uninitialized
in this function
unistr.c: At top level:
unistr.c:118: parse error before `if'
unistr.c:123: warning: type defaults to `int' in
declaration of `c1'
unistr.c:123: `name1' undeclared here (not in a
unistr.c:123: warning: data definition has no type or
storage class
unistr.c:124: parse error before `if'
make[2]: *** [unistr.o] Error 1
make[2]: Leaving directory `/home/linux/fs/ntfs'
make[1]: *** [_modsubdir_ntfs] Error 2
make[1]: Leaving directory `/home/linux/fs'
make: *** [_mod_fs] Error 2


_____________________________________________________________________________ - Father's Day Shopping
- Find the perfect gift for your Dad for Father's Day
To unsubscribe from this list: send the line "unsubscribe linux-kernel" in
the body of a message to
More majordomo info at
Please read the FAQ at

 \ /
  Last update: 2005-03-22 12:58    [W:0.047 / U:1.244 seconds]
©2003-2020 Jasper Spaans|hosted at Digital Ocean and TransIP|Read the blog|Advertise on this site