lkml.org 
[lkml]   [2000]   [Dec]   [11]   [last100]   RSS Feed
Views: [wrap][no wrap]   [headers]  [forward] 
 
Messages in this thread
/
From
Date
Subjectmake modules exits on test12-pre8
Hallo,

tried to compile test12-pre8 and make modules exits with:


>make[2]: Entering directory `/usr/src/linux-2.4.0.12pre8/fs/smbfs'
gcc -D__KERNEL__ -I/usr/src/linux/include -Wall -Wstrict-prototypes -O2
-fomit-frame-pointer -fno-strict-aliasing -pipe -mpreferred-stack-boundary=2
-march=i586 -DMODULE -DMODVERSIONS -include
/usr/src/linux/include/linux/modversions.h -DSMBFS_PARANOIA -c -o sock.o
sock.c
>sock.c: In function `smb_data_ready':
>sock.c:166: structure has no member named `next'
>make[2]: *** [sock.o] Error 1
>make[2]: Leaving directory `/usr/src/linux-2.4.0.12pre8/fs/smbfs'
>make[1]: *** [_modsubdir_smbfs] Error 2
>make[1]: Leaving directory `/usr/src/linux-2.4.0.12pre8/fs'
>make: *** [_mod_fs] Error 2

kind regards
Norbert
-
To unsubscribe from this list: send the line "unsubscribe linux-kernel" in
the body of a message to majordomo@vger.kernel.org
Please read the FAQ at http://www.tux.org/lkml/

\
 
 \ /
  Last update: 2005-03-22 12:52    [W:0.017 / U:0.456 seconds]
©2003-2020 Jasper Spaans|hosted at Digital Ocean and TransIP|Read the blog|Advertise on this site