lkml.org 
[lkml]   [1997]   [Apr]   [26]   [last100]   RSS Feed
Views: [wrap][no wrap]   [headers]  [forward] 
 
Messages in this thread
/
Date
From
Subject2.1.35 compile fails due to assembler error

2.1.36 fails with this message... any ideas/comments/suggestions?

make[2]: Entering directory `/usr/src/linux-2.1.36/arch/i386/lib'
gcc -D__KERNEL__ -I/usr/src/linux/include -Wall -Wstrict-prototypes -O3
-fomit-frame-pointer -pipe -fno-strength-reduce -m486 -malign-loops=2
-malign-jumps=2 -malign-functions=2 -DCPU=586 -c -o checksum.o checksum.c
{standard input}: Assembler messages:
{standard input}:488: Fatal error: Symbol end_of_body already defined.
make[2]: *** [checksum.o] Error 1
make[2]: Leaving directory `/usr/src/linux-2.1.36/arch/i386/lib'
make[1]: *** [first_rule] Error 2
make[1]: Leaving directory `/usr/src/linux-2.1.36/arch/i386/lib'
make: *** [linuxsubdirs] Error 2




.sig under construction


\
 
 \ /
  Last update: 2005-03-22 13:39    [W:0.023 / U:2.852 seconds]
©2003-2020 Jasper Spaans|hosted at Digital Ocean and TransIP|Read the blog|Advertise on this site