[lkml]   [1997]   [Jan]   [27]   [last100]   RSS Feed
Views: [wrap][no wrap]   [headers]  [forward] 
Messages in this thread
Subject2.1.23 mkiss error
Ok, I've passed the make zImage phase, but I get this from the make
modules one:

gcc -D__KERNEL__ -I/usr/src/linux/include -Wall -Wstrict-prototypes -O2 -fomit-frame-pointer -pipe -fno-strength-reduce -m486 -malign-loops=2 -malign-jumps=2 -malign-functions=2 -DCPU=586 -DMODULE -DMODVERSIONS -include /usr/src/linux/include/linux/modversions.h -c -o mkiss.o mkiss.c
mkiss.c: In function `mkiss_init_ctrl_dev':
mkiss.c:842: structure has no member named `select'
make[2]: *** [mkiss.o] Error 1
make[2]: Leaving directory `/usr/src/linux/drivers/net'
make[1]: *** [modules] Error 2
make[1]: Leaving directory `/usr/src/linux/drivers'
make: *** [modules] Error 2
root:/usr/src/linux #




Pierfrancesco Caci | internet: |
ik5pvx | | Office for the Complication
Firenze - Italia | | of Otherwise Simple Affairs
Linux penny 2.1.21 #5 Sat Jan 18 00:21:21 MET 1997 i586

 \ /
  Last update: 2005-03-22 13:38    [W:0.017 / U:0.916 seconds]
©2003-2020 Jasper Spaans|hosted at Digital Ocean and TransIP|Read the blog|Advertise on this site