[lkml]   [2009]   [Sep]   [28]   [last100]   RSS Feed
Views: [wrap][no wrap]   [headers]  [forward] 
Messages in this thread
    SubjectLinux 2.6.32-rc1 compile error
    ------------ snip ------------
    CC kernel/time/tick-oneshot.o
    CC kernel/time/tick-sched.o
    LD kernel/time/built-in.o
    CC kernel/futex.o
    CC kernel/rtmutex.o
    CC kernel/dma.o
    CC kernel/smp.o
    CC kernel/spinlock.o
    CC kernel/uid16.o
    CC kernel/module.o
    kernel/module.c:1995: warning: type defaults to ‘int’ in declaration of ‘Elf_Hdr’
    kernel/module.c:1995: error: expected ‘;’, ‘,’ or ‘)’ before ‘*’ token
    kernel/module.c: In function ‘load_module’:
    kernel/module.c:2203: error: ‘strmap’ undeclared (first use in this function)
    kernel/module.c:2203: error: (Each undeclared identifier is reported only once
    kernel/module.c:2203: error: for each function it appears in.)
    kernel/module.c:2239: error: ‘symoffs’ undeclared (first use in this function)
    kernel/module.c:2239: error: implicit declaration of function ‘layout_symtab’
    kernel/module.c:2240: error: ‘stroffs’ undeclared (first use in this function)
    make[1]: *** [kernel/module.o] Fehler 1
    make: *** [kernel] Fehler 2

    seemed to be a strange .config, which is attached.

    [unhandled content-type:application/octet-stream]
     \ /
      Last update: 2009-09-28 16:37    [W:0.021 / U:31.380 seconds]
    ©2003-2016 Jasper Spaans. hosted at Digital OceanAdvertise on this site