[lkml]   [2008]   [Aug]   [21]   [last100]   RSS Feed
Views: [wrap][no wrap]   [headers]  [forward] 
Messages in this thread
    SubjectUML build failure in 2.6.27-rc3
    Is this a known problem?

    SYMLINK arch/um/include/kern_constants.h
    SYMLINK arch/um/include/sysdep
    make[2]: `arch/um/sys-i386/user-offsets.s' is up to date.
    CHK arch/um/include/user_constants.h
    Using /usr/projects/linux/ext4 as source for kernel
    GEN /usr/projects/linux/uml/Makefile
    CHK include/linux/version.h
    CHK include/linux/utsrelease.h
    CALL /usr/projects/linux/ext4/scripts/
    CHK include/linux/compile.h
    CC arch/um/kernel/ptrace.o
    /usr/projects/linux/ext4/arch/um/kernel/ptrace.c:230: error: static declaration of ‘send_sigtrap’ follows non-static declaration
    include2/asm/ptrace-generic.h:51: error: previous declaration of ‘send_sigtrap’ was here
    make[2]: *** [arch/um/kernel/ptrace.o] Error 1
    make[1]: *** [arch/um/kernel] Error 2
    make: *** [sub-make] Error 2
    To unsubscribe from this list: send the line "unsubscribe linux-kernel" in
    the body of a message to
    More majordomo info at
    Please read the FAQ at

     \ /
      Last update: 2008-08-21 17:23    [W:0.021 / U:40.496 seconds]
    ©2003-2016 Jasper Spaans. hosted at Digital OceanAdvertise on this site