lkml.org 
[lkml]   [2008]   [Jun]   [10]   [last100]   RSS Feed
Views: [wrap][no wrap]   [headers]  [forward] 
 
Messages in this thread
/
From
SubjectRe: 2.6.26-rc5-mm2 compile error in vmscan.c
Date
Hi,

Helge Hafting <helge.hafting@aitel.hist.no> writes:

> Andrew Morton wrote:
>> ftp://ftp.kernel.org/pub/linux/kernel/people/akpm/patches/2.6/2.6.26-rc5/2.6.26-rc5-mm2/
>>
>> - This is a bugfixed version of 2.6.26-rc5-mm1 - mainly to repair a
>> vmscan.c bug which would have prevented testing of the other vmscan.c
>> bugs^Wchanges.
>>
>
> Interesting to try out, but I got this:
>
> $ make
> CHK include/linux/version.h
> CHK include/linux/utsrelease.h
> CALL scripts/checksyscalls.sh
> CHK include/linux/compile.h
> CC mm/vmscan.o
> mm/vmscan.c: In function 'show_page_path':
> mm/vmscan.c:2419: error: 'struct mm_struct' has no member named 'owner'
> make[1]: *** [mm/vmscan.o] Error 1
> make: *** [mm] Error 2
>
>
> I then tried to configure with "Track page owner", but that did not
> change anything.

CONFIG_PAGE_OWNER is something else, owner is only active if
CONFIG_MM_OWNER is set.

Hannes


\
 
 \ /
  Last update: 2008-06-10 14:25    [from the cache]
©2003-2011 Jasper Spaans