[lkml]   [2007]   [Nov]   [28]   [last100]   RSS Feed
Views: [wrap][no wrap]   [headers]  [forward] 
Messages in this thread
    SubjectRe: 2.6.24-rc3-mm2 (build failure on arm)
    Crossbuild on arm with shark_deconfig fails:

    CC [M] sound/oss/uart401.o
    CC net/sched/sch_generic.o
    CC net/core/dst.o
    AS arch/arm/lib/getuser.o
    drivers/ide/arm/ide_arm.c: In function 'ide_arm_init':
    drivers/ide/arm/ide_arm.c:42: error: implicit declaration of function
    make[2]: *** [drivers/ide/arm/ide_arm.o] Error 1
    make[1]: *** [drivers/ide] Error 2
    make[1]: *** Waiting for unfinished jobs....
    CC net/core/netevent.o
    CC net/core/neighbour.o

    To unsubscribe from this list: send the line "unsubscribe linux-kernel" in
    the body of a message to
    More majordomo info at
    Please read the FAQ at

     \ /
      Last update: 2007-11-28 20:57    [W:0.019 / U:0.100 seconds]
    ©2003-2016 Jasper Spaans. hosted at Digital OceanAdvertise on this site