[lkml]   [2007]   [Nov]   [20]   [last100]   RSS Feed
Views: [wrap][no wrap]   [headers]  [forward] 
Messages in this thread
    SubjectRe: mm snapshot broken-out-2007-11-20-01-45 Build Failure mach_apic.h
    Hi Andrew,

    The kernel build fails, on one of the machine

    CC arch/x86/mach-generic/summit.o
    In file included from arch/x86/mach-generic/summit.c:16:
    include/asm/mach-summit/mach_apic.h: In function ‘target_cpus’:
    include/asm/mach-summit/mach_apic.h:23: error: ‘per_cpu__cpu_mask’ undeclared (first use in this function)
    include/asm/mach-summit/mach_apic.h:23: error: (Each undeclared identifier is reported only once
    include/asm/mach-summit/mach_apic.h:23: error: for each function it appears in.)
    include/asm/mach-summit/mach_apic.h:23: warning: type defaults to ‘int’ in declaration of ‘type name’
    include/asm/mach-summit/mach_apic.h:23: error: invalid type argument of ‘unary *’
    make[1]: *** [arch/x86/mach-generic/summit.o] Error 1
    make: *** [arch/x86/mach-generic] Error 2

    Thanks & Regards,
    Kamalesh Babulal,
    Linux Technology Center,
    IBM, ISTL.
    To unsubscribe from this list: send the line "unsubscribe linux-kernel" in
    the body of a message to
    More majordomo info at
    Please read the FAQ at

     \ /
      Last update: 2007-11-20 15:25    [W:0.019 / U:1.976 seconds]
    ©2003-2016 Jasper Spaans. hosted at Digital OceanAdvertise on this site