lkml.org 
[lkml]   [2007]   [Nov]   [20]   [last100]   RSS Feed
Views: [wrap][no wrap]   [headers]  [forward] 
 
Messages in this thread
/
Date
From
SubjectRe: mm snapshot broken-out-2007-11-20-01-45 Build Fail - net/wireless driver
Hi Andrew,

The kernel build fails, with following message

LD drivers/net/wireless/built-in.o
drivers/net/wireless/rtl8187.o: In function `rtl8225z2_rf_init':
(.opd+0x180): multiple definition of `rtl8225z2_rf_init'
drivers/net/wireless/rtl8180.o:(.opd+0x1b0): first defined here
drivers/net/wireless/rtl8187.o: In function `rtl8225z2_rf_init':
/root/linux-2.6.24-rc3/drivers/net/wireless/rtl8187_rtl8225.c:571: multiple definition of `.rtl8225z2_rf_init'
drivers/net/wireless/rtl8180.o:/root/linux-2.6.24-rc3/drivers/net/wireless/rtl8180_rtl8225.c:561: first defined here
ld: Warning: size of symbol `.rtl8225z2_rf_init' changed from 3836 in drivers/net/wireless/rtl8180.o to 3544 in drivers/net/wireless/rtl8187.o
drivers/net/wireless/rtl8187.o: In function `rtl8225_rf_set_channel':
(.opd+0x160): multiple definition of `rtl8225_rf_set_channel'
drivers/net/wireless/rtl8180.o:(.opd+0x1d0): first defined here
drivers/net/wireless/rtl8187.o: In function `rtl8225_rf_init':
/root/linux-2.6.24-rc3/drivers/net/wireless/rtl8187_rtl8225.c:329: multiple definition of `.rtl8225_rf_init'
drivers/net/wireless/rtl8180.o:/root/linux-2.6.24-rc3/drivers/net/wireless/rtl8180_rtl8225.c:322: first defined here
ld: Warning: size of symbol `.rtl8225_rf_init' changed from 3492 in drivers/net/wireless/rtl8180.o to 3528 in drivers/net/wireless/rtl8187.o
drivers/net/wireless/rtl8187.o: In function `rtl8225_rf_stop':
(.opd+0x190): multiple definition of `rtl8225_rf_stop'
drivers/net/wireless/rtl8180.o:(.opd+0x1c0): first defined here
drivers/net/wireless/rtl8187.o: In function `rtl8225_rf_set_channel':
/root/linux-2.6.24-rc3/drivers/net/wireless/rtl8187_rtl8225.c:735: multiple definition of `.rtl8225_rf_set_channel'
drivers/net/wireless/rtl8180.o:/root/linux-2.6.24-rc3/drivers/net/wireless/rtl8180_rtl8225.c:753: first defined here
ld: Warning: size of symbol `.rtl8225_rf_set_channel' changed from 360 in drivers/net/wireless/rtl8180.o to 136 in drivers/net/wireless/rtl8187.o
drivers/net/wireless/rtl8187.o: In function `rtl8225_rf_init':
(.opd+0x170): multiple definition of `rtl8225_rf_init'
drivers/net/wireless/rtl8180.o:(.opd+0x1a0): first defined here
drivers/net/wireless/rtl8187.o: In function `rtl8225_rf_stop':
/root/linux-2.6.24-rc3/drivers/net/wireless/rtl8187_rtl8225.c:719: multiple definition of `.rtl8225_rf_stop'
drivers/net/wireless/rtl8180.o:/root/linux-2.6.24-rc3/drivers/net/wireless/rtl8180_rtl8225.c:736: first defined here
ld: Warning: size of symbol `.rtl8225_rf_stop' changed from 244 in drivers/net/wireless/rtl8180.o to 632 in drivers/net/wireless/rtl8187.o
make[3]: *** [drivers/net/wireless/built-in.o] Error 1
make[2]: *** [drivers/net/wireless] Error 2
make[1]: *** [drivers/net] Error 2
make: *** [drivers] Error 2

The patch causing this build failure, might be git-wireless.patch.

--
Thanks & Regards,
Kamalesh Babulal,
Linux Technology Center,
IBM, ISTL.
-
To unsubscribe from this list: send the line "unsubscribe linux-kernel" in
the body of a message to majordomo@vger.kernel.org
More majordomo info at http://vger.kernel.org/majordomo-info.html
Please read the FAQ at http://www.tux.org/lkml/

\
 
 \ /
  Last update: 2007-11-20 14:33    [from the cache]
©2003-2011 Jasper Spaans. Advertise on this site