lkml.org 
[lkml]   [2006]   [Sep]   [20]   [last100]   RSS Feed
Views: [wrap][no wrap]   [headers]  [forward] 
 
Messages in this thread
/
Date
From
SubjectRe: UML build failure with 2.6.18
On Wed, Sep 20, 2006 at 05:27:12PM +0400, Mitch@0Bits.COM wrote:
> anyone having UML build failure with the shiny new 2.6.18

> CC arch/um/os-Linux/process.o
> arch/um/os-Linux/process.c:144: error: syntax error before 'getpid'
> arch/um/os-Linux/process.c:146: warning: return type defaults to 'int'
> arch/um/os-Linux/process.c:146: warning: function declaration isn't a
> prototype
> arch/um/os-Linux/process.c: In function '_syscall0':
> arch/um/os-Linux/process.c:147: error: syntax error before '{' token
> arch/um/os-Linux/process.c:162: error: syntax error before 'prot'
> arch/um/os-Linux/process.c:209: error: parameter 'ok' is initialized
> arch/um/os-Linux/process.c:211: error: syntax error before 'printk'
> arch/um/os-Linux/process.c:279: error: syntax error before '*' token
> make[1]: *** [arch/um/os-Linux/process.o] Error 1
> make: *** [arch/um/os-Linux] Error 2

What's the host distro?

I just built (plus the jmmpbuf patch, which isn't the problem here)
and booted it, and it seems fine here.

Jeff
-
To unsubscribe from this list: send the line "unsubscribe linux-kernel" in
the body of a message to majordomo@vger.kernel.org
More majordomo info at http://vger.kernel.org/majordomo-info.html
Please read the FAQ at http://www.tux.org/lkml/

\
 
 \ /
  Last update: 2006-09-20 17:29    [from the cache]
©2003-2014 Jasper Spaans. Advertise on this site