lkml.org 
[lkml]   [2004]   [Jun]   [21]   [last100]   RSS Feed
Views: [wrap][no wrap]   [headers]  [forward] 
 
Messages in this thread
    /
    Date
    From
    SubjectRe: 2.6.7-mm1
    On Mon, 21 Jun 2004, Eric BEGOT wrote:

    > I can't compile 2.6.7-mm1. here are the errors :
    >
    > CC security/selinux/hooks.o
    >
    > security/selinux/hooks.c:4129: error: `selinux_netlink_send' undeclared here (not in a function)
    >
    > security/selinux/hooks.c:4129: error: initializer element is not constant
    >
    > security/selinux/hooks.c:4129: error: (near initialization for `selinux_ops.netlink_send')
    >
    > security/selinux/hooks.c:4130: error: `selinux_netlink_recv' undeclared here (not in a function)
    >
    > security/selinux/hooks.c:4130: error: initializer element is not constant
    >
    > security/selinux/hooks.c:4130: error: (near initialization for `selinux_ops.netlink_recv')
    >
    > make[2]: *** [security/selinux/hooks.o] Error 1
    >
    > make[1]: *** [security/selinux] Error 2
    >
    > make: *** [security] Error 2
    >
    >
    > With the same config, the 2.6.7 compiles perfectly. I join my .config.

    Works ok for me. What arch are you using?

    Also, didn't see any attached config.


    - James
    --
    James Morris
    <jmorris@redhat.com>



    -
    To unsubscribe from this list: send the line "unsubscribe linux-kernel" in
    the body of a message to majordomo@vger.kernel.org
    More majordomo info at http://vger.kernel.org/majordomo-info.html
    Please read the FAQ at http://www.tux.org/lkml/

    \
     
     \ /
      Last update: 2005-03-22 14:04    [W:0.019 / U:0.208 seconds]
    ©2003-2016 Jasper Spaans. hosted at Digital OceanAdvertise on this site