lkml.org 
[lkml]   [2003]   [Aug]   [16]   [last100]   RSS Feed
Views: [wrap][no wrap]   [headers]  [forward] 
 
Messages in this thread
/
Date
From
SubjectRe: 2.6.0-test3 current - firewire compile error
On Sat, Aug 16, 2003 at 08:50:19AM -0400, Ivan Gyurdiev wrote:
> Hopefully, this is not a duplicate post:
> ===========================================
>
> drivers/ieee1394/nodemgr.c: In function `nodemgr_update_ud_names':
> drivers/ieee1394/nodemgr.c:471: error: structure has no member named `name'
> drivers/ieee1394/nodemgr.c: In function `nodemgr_create_node':
> drivers/ieee1394/nodemgr.c:723: error: structure has no member named `name'
> drivers/ieee1394/nodemgr.c: In function `nodemgr_update_node':
> drivers/ieee1394/nodemgr.c:1318: error: structure has no member named `name'
> drivers/ieee1394/nodemgr.c: In function `nodemgr_add_host':
> drivers/ieee1394/nodemgr.c:1775: error: structure has no member named `name'
> make[2]: *** [drivers/ieee1394/nodemgr.o] Error 1
> make[1]: *** [drivers/ieee1394] Error 2
> make: *** [drivers] Error 2

I removed struct device.name and forgot to change the firewire code :(

I'll work on a patch for this later this evening, unless someone beats
me to it.

Sorry,

greg k-h
-
To unsubscribe from this list: send the line "unsubscribe linux-kernel" in
the body of a message to majordomo@vger.kernel.org
More majordomo info at http://vger.kernel.org/majordomo-info.html
Please read the FAQ at http://www.tux.org/lkml/

\
 
 \ /
  Last update: 2005-03-22 13:47    [W:0.279 / U:0.592 seconds]
©2003-2014 Jasper Spaans. Advertise on this site