lkml.org 
[lkml]   [2003]   [Jul]   [16]   [last100]   RSS Feed
Views: [wrap][no wrap]   [headers]  [forward] 
 
Messages in this thread
/
Date
From
SubjectPROBLEM: make xconfig segfaults, menuconfig fails
Typing 'make xconfig' segfaults - core dump can be sent if you need

'make menuconfig' produces errors and fails (output attached)

I am attaching the output of ver_linux

I am using Mandrake 9.1

qt rpms installed

libqt3-common-3.1.1-13mdk
libqt3-3.1.1-13mdk
libqt3-devel-3.1.1-13mdk


Mikemake[1]: `scripts/kconfig/mconf' is up to date.
HOSTCC scripts/lxdialog/checklist.o
In file included from scripts/lxdialog/checklist.c:24:
scripts/lxdialog/dialog.h:29:20: curses.h: No such file or directory
In file included from scripts/lxdialog/checklist.c:24:
scripts/lxdialog/dialog.h:127: parse error before "use_colors"
scripts/lxdialog/dialog.h:127: warning: type defaults to `int' in declaration of `use_colors'
scripts/lxdialog/dialog.h:127: warning: data definition has no type or storage class
scripts/lxdialog/dialog.h:128: parse error before "use_shadow"
scripts/lxdialog/dialog.h:128: warning: type defaults to `int' in declaration of `use_shadow'
scripts/lxdialog/dialog.h:128: warning: data definition has no type or storage class
scripts/lxdialog/dialog.h:130: parse error before "attributes"
scripts/lxdialog/dialog.h:130: warning: type defaults to `int' in declaration of `attributes'
scripts/lxdialog/dialog.h:130: warning: data definition has no type or storage class
scripts/lxdialog/dialog.h:143: parse error before '*' token
scripts/lxdialog/dialog.h:143: warning: function declaration isn't a prototype
scripts/lxdialog/dialog.h:146: parse error before '*' token
scripts/lxdialog/dialog.h:146: warning: function declaration isn't a prototype
scripts/lxdialog/dialog.h:147: parse error before '*' token
scripts/lxdialog/dialog.h:147: warning: function declaration isn't a prototype
scripts/lxdialog/dialog.h:148: parse error before '*' token
scripts/lxdialog/dialog.h:149: warning: function declaration isn't a prototype
scripts/lxdialog/dialog.h:150: parse error before '*' token
scripts/lxdialog/dialog.h:150: warning: function declaration isn't a prototype
scripts/lxdialog/checklist.c:32: parse error before '*' token
scripts/lxdialog/checklist.c:34: warning: function declaration isn't a prototype
scripts/lxdialog/checklist.c: In function `print_item':
scripts/lxdialog/checklist.c:38: warning: implicit declaration of function `wattrset'
scripts/lxdialog/checklist.c:38: `win' undeclared (first use in this function)
scripts/lxdialog/checklist.c:38: (Each undeclared identifier is reported only once
scripts/lxdialog/checklist.c:38: for each function it appears in.)
scripts/lxdialog/checklist.c:39: warning: implicit declaration of function `wmove'
scripts/lxdialog/checklist.c:39: `choice' undeclared (first use in this function)
scripts/lxdialog/checklist.c:41: warning: implicit declaration of function `waddch'
scripts/lxdialog/checklist.c:44: `selected' undeclared (first use in this function)
scripts/lxdialog/checklist.c:46: warning: implicit declaration of function `wprintw'
scripts/lxdialog/checklist.c:46: `status' undeclared (first use in this function)
scripts/lxdialog/checklist.c:51: warning: implicit declaration of function `mvwaddch'
scripts/lxdialog/checklist.c:51: `item' undeclared (first use in this function)
scripts/lxdialog/checklist.c:53: warning: implicit declaration of function `waddstr'
scripts/lxdialog/checklist.c:56: warning: implicit declaration of function `wrefresh'
scripts/lxdialog/checklist.c: At top level:
scripts/lxdialog/checklist.c:64: parse error before '*' token
scripts/lxdialog/checklist.c:66: warning: function declaration isn't a prototype
scripts/lxdialog/checklist.c: In function `print_arrows':
scripts/lxdialog/checklist.c:67: `win' undeclared (first use in this function)
scripts/lxdialog/checklist.c:67: `y' undeclared (first use in this function)
scripts/lxdialog/checklist.c:67: `x' undeclared (first use in this function)
scripts/lxdialog/checklist.c:69: `scroll' undeclared (first use in this function)
scripts/lxdialog/checklist.c:82: `height' undeclared (first use in this function)
scripts/lxdialog/checklist.c:85: `item_no' undeclared (first use in this function)
scripts/lxdialog/checklist.c:85: `choice' undeclared (first use in this function)
scripts/lxdialog/checklist.c: At top level:
scripts/lxdialog/checklist.c:103: parse error before '*' token
scripts/lxdialog/checklist.c:104: warning: function declaration isn't a prototype
scripts/lxdialog/checklist.c: In function `print_buttons':
scripts/lxdialog/checklist.c:105: `width' undeclared (first use in this function)
scripts/lxdialog/checklist.c:106: `height' undeclared (first use in this function)
scripts/lxdialog/checklist.c:108: `dialog' undeclared (first use in this function)
scripts/lxdialog/checklist.c:108: `selected' undeclared (first use in this function)
scripts/lxdialog/checklist.c: In function `dialog_checklist':
scripts/lxdialog/checklist.c:126: `WINDOW' undeclared (first use in this function)
scripts/lxdialog/checklist.c:126: `dialog' undeclared (first use in this function)
scripts/lxdialog/checklist.c:126: `list' undeclared (first use in this function)
scripts/lxdialog/checklist.c:126: warning: left-hand operand of comma expression has no effect
scripts/lxdialog/checklist.c:132: warning: implicit declaration of function `endwin'
scripts/lxdialog/checklist.c:133: warning: implicit declaration of function `fprintf'
scripts/lxdialog/checklist.c:133: `stderr' undeclared (first use in this function)
scripts/lxdialog/checklist.c:148: `COLS' undeclared (first use in this function)
scripts/lxdialog/checklist.c:149: `LINES' undeclared (first use in this function)
scripts/lxdialog/checklist.c:151: `stdscr' undeclared (first use in this function)
scripts/lxdialog/checklist.c:153: warning: implicit declaration of function `newwin'
scripts/lxdialog/checklist.c:154: warning: implicit declaration of function `keypad'
scripts/lxdialog/checklist.c:154: `TRUE' undeclared (first use in this function)
scripts/lxdialog/checklist.c:187: warning: implicit declaration of function `subwin'
scripts/lxdialog/checklist.c:219: warning: implicit declaration of function `wnoutrefresh'
scripts/lxdialog/checklist.c:221: warning: implicit declaration of function `doupdate'
scripts/lxdialog/checklist.c:224: warning: implicit declaration of function `wgetch'
scripts/lxdialog/checklist.c:231: `KEY_UP' undeclared (first use in this function)
scripts/lxdialog/checklist.c:231: `KEY_DOWN' undeclared (first use in this function)
scripts/lxdialog/checklist.c:241: `FALSE' undeclared (first use in this function)
scripts/lxdialog/checklist.c:242: warning: implicit declaration of function `scrollok'
scripts/lxdialog/checklist.c:243: warning: implicit declaration of function `wscrl'
scripts/lxdialog/checklist.c:270: called object is not a function
scripts/lxdialog/checklist.c:305: warning: implicit declaration of function `delwin'
scripts/lxdialog/checklist.c:309: `KEY_LEFT' undeclared (first use in this function)
scripts/lxdialog/checklist.c:310: `KEY_RIGHT' undeclared (first use in this function)
/usr/include/bits/string2.h: At top level:
scripts/lxdialog/dialog.h:130: warning: array `attributes' assumed to have one element
make[1]: *** [scripts/lxdialog/checklist.o] Error 1
make: *** [menuconfig] Error 2
If some fields are empty or look unusual you may have an old version.
Compare to the current minimal requirements in Documentation/Changes.

Linux linux1 2.4.21-0.13mdk #1 Fri Mar 14 15:08:06 EST 2003 i686 unknown unknown GNU/Linux

Gnu C 3.2.2
Gnu make 3.80
util-linux 2.11x
mount 2.11x
module-init-tools 2.4.22
e2fsprogs 1.32
PPP 2.4.1
Linux C Library 2.3.1
Dynamic linker (ldd) 2.3.1
Procps 3.1.6
Net-tools 1.60
Console-tools 0.2.3
Sh-utils 4.5.7
Modules Loaded isofs nls_iso8859-15 ppp_deflate zlib_inflate zlib_deflate bsd_comp udf binfmt_misc parport_pc lp parport sg st sr_mod sd_mod scsi_mod ipt_TOS ipt_MASQUERADE ipt_LOG ipt_REJECT ipt_state iptable_mangle ip_nat_irc ip_nat_ftp iptable_nat ip_conntrack_irc ip_conntrack_ftp ip_conntrack iptable_filter ip_tables snd-seq-midi snd-seq-oss snd-seq-midi-event snd-seq snd-pcm-oss snd-mixer-oss snd-cs46xx snd-ac97-codec snd-rawmidi snd-seq-device snd-pcm snd-timer gameport snd-page-alloc snd soundcore nfsd ppp_async ppp_generic slhc af_packet ide-floppy ide-tape ide-cd cdrom floppy 3c59x supermount printer usb-ohci usbcore rtc ext3 jbd
CHK include/linux/version.h
UPD include/linux/version.h
Making asm->asm-i386 symlink
CC scripts/empty.o
MKELF scripts/elfconfig.h
HOSTCC scripts/file2alias.o
HOSTCC scripts/modpost.o
HOSTLD scripts/modpost
make[1]: `scripts/kconfig/conf' is up to date.
./scripts/kconfig/conf -s arch/i386/Kconfig
boolean symbol BINFMT_ZFLAT tested for 'm'? test forced to 'n'
#
# using defaults found in .config
#
SPLIT include/linux/autoconf.h -> include/config/*
CC arch/i386/kernel/asm-offsets.s
CHK include/asm-i386/asm_offsets.h
UPD include/asm-i386/asm_offsets.h
CC init/main.o
CHK include/linux/compile.h
UPD include/linux/compile.h
CC init/version.o
CC init/do_mounts.o
CC init/do_mounts_rd.o
CC init/do_mounts_initrd.o
CC init/do_mounts_md.o
LD init/mounts.o
CC init/initramfs.o
LD init/built-in.o
HOSTCC usr/gen_init_cpio
CPIO usr/initramfs_data.cpio
GZIP usr/initramfs_data.cpio.gz
echo " .section .init.ramfs,\"a\"" > usr/initramfs_data.S
echo ".incbin \"usr/initramfs_data.cpio.gz\"" >> usr/initramfs_data.S
AS usr/initramfs_data.o
LD usr/built-in.o
CC arch/i386/kernel/process.o
CC arch/i386/kernel/semaphore.o
CC arch/i386/kernel/signal.o
AS arch/i386/kernel/entry.o
CC arch/i386/kernel/traps.o
CC arch/i386/kernel/irq.o
CC arch/i386/kernel/vm86.o
CC arch/i386/kernel/ptrace.o
CC arch/i386/kernel/i8259.o
CC arch/i386/kernel/ioport.o
CC arch/i386/kernel/ldt.o
CC arch/i386/kernel/setup.o
CC arch/i386/kernel/time.o
CC arch/i386/kernel/sys_i386.o
CC arch/i386/kernel/pci-dma.o
CC arch/i386/kernel/i386_ksyms.o
CC arch/i386/kernel/i387.o
CC arch/i386/kernel/dmi_scan.o
CC arch/i386/kernel/bootflag.o
CC arch/i386/kernel/doublefault.o
CC arch/i386/kernel/acpi/boot.o
LD arch/i386/kernel/acpi/built-in.o
CC arch/i386/kernel/cpu/common.o
CC arch/i386/kernel/cpu/proc.o
CC arch/i386/kernel/cpu/amd.o
CC arch/i386/kernel/cpu/cyrix.o
CC arch/i386/kernel/cpu/centaur.o
CC arch/i386/kernel/cpu/transmeta.o
CC arch/i386/kernel/cpu/intel.o
CC arch/i386/kernel/cpu/rise.o
CC arch/i386/kernel/cpu/nexgen.o
CC arch/i386/kernel/cpu/umc.o
LD arch/i386/kernel/cpu/cpufreq/built-in.o
CC arch/i386/kernel/cpu/mcheck/mce.o
CC arch/i386/kernel/cpu/mcheck/k7.o
CC arch/i386/kernel/cpu/mcheck/p4.o
CC arch/i386/kernel/cpu/mcheck/p5.o
CC arch/i386/kernel/cpu/mcheck/p6.o
CC arch/i386/kernel/cpu/mcheck/winchip.o
LD arch/i386/kernel/cpu/mcheck/built-in.o
CC arch/i386/kernel/cpu/mtrr/main.o
CC arch/i386/kernel/cpu/mtrr/if.o
CC arch/i386/kernel/cpu/mtrr/generic.o
CC arch/i386/kernel/cpu/mtrr/state.o
CC arch/i386/kernel/cpu/mtrr/amd.o
CC arch/i386/kernel/cpu/mtrr/cyrix.o
CC arch/i386/kernel/cpu/mtrr/centaur.o
LD arch/i386/kernel/cpu/mtrr/built-in.o
LD arch/i386/kernel/cpu/built-in.o
CC arch/i386/kernel/timers/timer.o
CC arch/i386/kernel/timers/timer_none.o
CC arch/i386/kernel/timers/timer_tsc.o
CC arch/i386/kernel/timers/timer_pit.o
LD arch/i386/kernel/timers/built-in.o
CC arch/i386/kernel/reboot.o
CC arch/i386/kernel/mpparse.o
CC arch/i386/kernel/apic.o
CC arch/i386/kernel/nmi.o
CC arch/i386/kernel/io_apic.o
CC arch/i386/kernel/module.o
CC arch/i386/kernel/sysenter.o
AS arch/i386/kernel/vsyscall-int80.o
SYSCALL arch/i386/kernel/vsyscall-int80.so
AS arch/i386/kernel/vsyscall-sysenter.o
SYSCALL arch/i386/kernel/vsyscall-sysenter.so
AS arch/i386/kernel/vsyscall.o
SYSCALL arch/i386/kernel/vsyscall-syms.o
LD arch/i386/kernel/built-in.o
AS arch/i386/kernel/head.o
CC arch/i386/kernel/init_task.o
CC arch/i386/mm/init.o
CC arch/i386/mm/pgtable.o
CC arch/i386/mm/fault.o
CC scripts/empty.o
MKELF scripts/elfconfig.h
HOSTCC scripts/file2alias.o
CC arch/i386/mm/ioremap.o
HOSTCC scripts/modpost.o
CC arch/i386/mm/extable.o
HOSTLD scripts/modpost
make[1]: `scripts/kconfig/qconf' is up to date.
./scripts/kconfig/qconf arch/i386/Kconfig
CC arch/i386/mm/pageattr.o
Xlib: extension "GLX" missing on display ":1.0".
Xlib: extension "GLX" missing on display ":1.0".
LD arch/i386/mm/built-in.o
CC arch/i386/mach-default/setup.o
Xlib: extension "RENDER" missing on display ":1.0".
make: *** [xconfig] Segmentation fault (core dumped)
CC arch/i386/mach-default/topology.o
LD arch/i386/mach-default/built-in.o
CC kernel/sched.o
CC kernel/fork.o
CC kernel/exec_domain.o
CC kernel/panic.o
CC kernel/printk.o
CC kernel/profile.o
CC kernel/exit.o
CC kernel/itimer.o
CC kernel/time.o
CC kernel/softirq.o
CC kernel/resource.o
CC kernel/sysctl.o
CC kernel/capability.o
CC kernel/ptrace.o
CC kernel/timer.o
CC kernel/user.o
CC kernel/signal.o
CC kernel/sys.o
CC kernel/kmod.o
\
 
 \ /
  Last update: 2005-03-22 13:46    [from the cache]
©2003-2014 Jasper Spaans. Advertise on this site