lkml.org 
[lkml]   [2000]   [Jul]   [11]   [last100]   RSS Feed
Views: [wrap][no wrap]   [headers]  [forward] 
 
Messages in this thread
/
Date
From
SubjectCompile Errors on 2.4.0-test3 final
I believe this is in a file that everyone has compiled in, so pardon me for not
posting all my system specs and my configuration. pre7 worked fine.

make[2]: Entering directory `/usr/src/linux/kernel'
gcc -D__KERNEL__ -I/usr/src/linux/include -Wall -Wstrict-prototypes -O2
-fomit-frame-pointer -pipe -march=i686 -malign-functions=4 -fschedule-insns2
-mwide-multiply -fexpensive-optimizations -fno-strict-aliasing -c -o timer.o
timer.c
timer.c: In function `update_process_times':
timer.c:580: structure has no member named `priority'
timer.c:580: `DEF_PRIORITY' undeclared (first use in this function)
timer.c:580: (Each undeclared identifier is reported only once
timer.c:580: for each function it appears in.)
make[2]: *** [timer.o] Error 1
make[2]: Leaving directory `/usr/src/linux/kernel'
make[1]: *** [first_rule] Error 2
make[1]: Leaving directory `/usr/src/linux/kernel'
make: *** [_dir_kernel] Error 2

Trever
--
For the finest in family and value oriented products: http://www.daysofyore.com
For owner friendly domain names: http://domains.daysofyore.com

-
To unsubscribe from this list: send the line "unsubscribe linux-kernel" in
the body of a message to majordomo@vger.rutgers.edu
Please read the FAQ at http://www.tux.org/lkml/

\
 
 \ /
  Last update: 2005-03-22 13:57    [W:0.033 / U:0.180 seconds]
©2003-2020 Jasper Spaans|hosted at Digital Ocean and TransIP|Read the blog|Advertise on this site