[lkml]   [2000]   [Dec]   [5]   [last100]   RSS Feed
Views: [wrap][no wrap]   [headers]  [forward] 
Messages in this thread
    Subjecttest12-pre5 does not compile
    I compile dummy.c into the kernel; make bzImage stops with:
    gcc -D__KERNEL__ -I/usr/src/linux/include -Wall -Wstrict-prototypes -O2 -fomit-frame-pointer -fno-strict-aliasing -pipe -march=i686 -malign-functions=4 -c -o dummy.o dummy.c
    dummy.c: In function `dummy_init_module':
    dummy.c:103: invalid type argument of `->'
    make[3]: *** [dummy.o] Error 1
    make[3]: Leaving directory `/usr/src/linux-2.4.0-test12-pre5/drivers/net'
    make[2]: *** [first_rule] Error 2
    make[2]: Leaving directory `/usr/src/linux-2.4.0-test12-pre5/drivers/net'
    make[1]: *** [_subdir_net] Error 2
    make[1]: Leaving directory `/usr/src/linux-2.4.0-test12-pre5/drivers'
    make: *** [_dir_drivers] Error 2

    Mirko Kloppstech
    To unsubscribe from this list: send the line "unsubscribe linux-kernel" in
    the body of a message to
    Please read the FAQ at

     \ /
      Last update: 2005-03-22 12:51    [W:0.019 / U:4.884 seconds]
    ©2003-2016 Jasper Spaans. hosted at Digital OceanAdvertise on this site