[lkml]   [2000]   [Jan]   [14]   [last100]   RSS Feed
Views: [wrap][no wrap]   [headers]  [forward] 
Messages in this thread
Subject2.3.39: error in acm.c
gcc -D__KERNEL__ -I/usr/src/linux/include -Wall -Wstrict-prototypes -O2
-fomit-frame-pointer -fno-strict-aliasing -pipe -fno-strength-reduce
-DCPU=586 -march=i586 -DMODULE -DMODVERSIONS -include
/usr/src/linux/include/linux/modversions.h -c -o acm.o acm.c
acm.c: In function `acm_probe':
acm.c:532: structure has no member named `linecoding'
acm.c:533: structure has no member named `linecoding'
acm.c:534: warning: implicit declaration of function `acm_set_coding'
acm.c:534: structure has no member named `linecoding'
make[2]: *** [acm.o] Error 1
make[2]: Leaving directory `/usr/src/linux-2.3.39/drivers/usb'
make[1]: *** [_modsubdir_usb] Error 2
make[1]: Leaving directory `/usr/src/linux-2.3.39/drivers'
make: *** [_mod_drivers] Error 2

Alexandre Hautequest - Linux User #116289
"When I'm on the road, I'm indestructible. No one can stop me. But they

O .br que não para de crescer:

To unsubscribe from this list: send the line "unsubscribe linux-kernel" in
the body of a message to
Please read the FAQ at

 \ /
  Last update: 2005-03-22 13:55    [from the cache]
©2003-2014 Jasper Spaans. hosted at Digital Ocean